{"text_format":"1","workbook":"xlsx","n_sheets":12,"sheets":["Instructions","Deal Builder","Internal Calc ","PDF Generator","New PDF","Resign Rules","Aggregated Data Rules","Bespoke SIM Only Rules","Conversion for PDF","Drop Downs","Lookups","Pricing"],"not_rendered":{"charts":0,"images":3,"macros":1,"external_links":0,"defined_names":68,"comments":0,"pivot_tables":0},"unopened":[],"bounds":{"document_bytes":16777216,"sheet_cells":100000,"rows_first":2000,"rows_last":500,"rows_between":2000,"halvings":0,"cell_chars":16384,"cell_head_chars":4096},"cells_cut":0,"cells_raw":0,"read":"whole","date_system":"1900"}

{"sheet":"Instructions","index":0,"n_rows":5,"n_cols":6,"rows_kept":5,"cut":false,"hidden":false,"merged":[]}
[null,null,null,null,null,"Instructions "]
[]
["Please fill out the Mandatory boxes F3-F15."]
["Network Code will auto populate after a quantity is entered."]
[" "]

{"sheet":"Deal Builder","index":1,"n_rows":42,"n_cols":16,"rows_kept":42,"cut":false,"hidden":false,"merged":[[0,3,0,12],[16,3,16,5],[30,3,30,5],[14,3,14,4],[2,3,2,4],[4,3,4,4],[4,5,4,6],[6,3,6,4],[6,5,6,6],[2,5,2,6],[8,5,8,6],[10,5,10,6]]}
[null,null,null,"Zest4 Deal Calculator v4.2.3",null,null,null,null,null,null,null,null,null,null,null,{"$f":"COUNTIF(G21:G28,\"Sim Only Aggregated\")+COUNTIF(G21:G28,\"Mobile Broadband Aggregated\")","v":0}]
[]
[null,null,null,"CBM Name: ",null,"Choose.."]
[]
[null,null,null,"Customer Name:"]
[]
[null,null,null,"Partner Name:"]
[]
{"$rows_left_out":35}
{"sheet":"Internal Calc ","index":2,"n_rows":29,"n_cols":10,"rows_kept":29,"cut":false,"hidden":false,"merged":[[6,0,6,1],[7,0,7,1],[27,3,27,4],[28,3,28,4],[20,0,20,1],[24,0,24,1],[25,0,25,1],[26,0,26,1],[0,0,0,6],[2,0,2,1],[3,0,3,1],[4,0,4,1],[5,0,5,1],[28,5,28,7],[8,0,8,1],[21,0,21,1],[22,0,22,1],[23,0,23,1],[16,0,16,1],[17,0,17,1],[18,0,18,1],[19,0,19,1],[13,0,13,1],[14,0,14,1],[15,0,15,1],[10,0,10,1],[11,0,11,1],[12,0,12,1]]}
["Zest4 Deal Sheet"]
[]
["Partner name ",null,{"$f":"IF('Deal Builder'!F7=\"\",\"\",'Deal Builder'!F7)","v":""}]
["Partner Code",null,{"$f":"IF('Deal Builder'!F9=\"\",\"\",'Deal Builder'!F9)","v":""}]
["Customer name ",null,{"$f":"IF('Deal Builder'!F5=\"\",\"\",'Deal Builder'!F5)","v":""}]
["Total Connections",null,{"$f":"IF(SUM('Deal Builder'!D21:D28)=0,\"\",SUM('Deal Builder'!D21:D28))","v":""}]
["Your Deal Reference",null,{"$f":"IF('Deal Builder'!F11=\"\",\"\",'Deal Builder'!F11)","v":""}]
["Estimated Customer Monthly Billing",null,{"$f":"F28","v":0}]
{"$rows_left_out":22}
{"sheet":"PDF Generator","index":3,"n_rows":27,"n_cols":7,"rows_kept":27,"cut":false,"hidden":true,"merged":[]}
[]
["Partner name ",{"$f":"'Internal Calc '!C3","v":""}]
["Partner Code",{"$f":"'Internal Calc '!C4","v":""}]
["Customer name ",{"$f":"'Internal Calc '!C5","v":""}]
["Total Voice Connections",{"$f":"'Internal Calc '!C6","v":""}]
["Your Deal Reference",{"$f":"'Internal Calc '!C7","v":""}]
["Estimated Customer Monthly Billing (Excluding Usage)",{"$f":"SUM(C12:C27)","v":0}]
["Bonuses on Month One",{"$f":"'Internal Calc '!#REF!","v":{"$error":"#REF!"}}]
{"$rows_left_out":20}
{"sheet":"New PDF","index":4,"n_rows":29,"n_cols":8,"rows_kept":29,"cut":false,"hidden":false,"merged":[[5,0,5,7],[31,0,31,7],[29,0,30,7]]}
[]
[]
[]
[]
[]
[{"$f":"\"Deal Summary For: \"&'Deal Builder'!F5","v":"Deal Summary For: "}]
[]
[{"$f":"\"Contract Term: \"&'Deal Builder'!F13&IF('Deal Builder'!F13=1,\" Month\",\" Months\")","v":"Contract Term: Choose.. Months"},null,null,null,null,null,"Zest4 Reference","ZES4064"]
{"$rows_left_out":22}
{"sheet":"Resign Rules","index":5,"n_rows":45,"n_cols":1,"rows_kept":45,"cut":false,"hidden":true,"merged":[]}
[]
[]
[]
[]
[]
[]
[]
[]
{"$rows_left_out":38}
{"sheet":"Aggregated Data Rules","index":6,"n_rows":23,"n_cols":1,"rows_kept":23,"cut":false,"hidden":true,"merged":[]}
["Aggregating Small Biz Sim Only Tariffs to avoid bill shock."]
["To give you the ability to compete with other offerings in the market we want to make available the option to build bespoke deals around using small biz tariffs and stacking them to create shared data bundles."]
["This is not a simple offering in the background and it presents some operational and commercial challenges.  We therefore need to have rules in place as to where and how this is offered and a clear process to ensure it is delivered to the customer/reseller correctly and declared to O2 correctly."]
["The rules are outlined below:"]
["1)      You need to get commercial sign off for each stackable shared biz opportunity"]
["2)      We will only offer this tariff for 50 users or over (amended to 20)"]
["3)      All users must be on the same small biz tariff – there are no mix and match options available e.g. all users on Small Biz 2GB"]
["4)      These tariffs are available for new / mig only"]
{"$rows_left_out":16}
{"sheet":"Bespoke SIM Only Rules","index":7,"n_rows":16,"n_cols":1,"rows_kept":16,"cut":false,"hidden":true,"merged":[]}
["O2 Bespoke SIM Only Deals – Dealer / In house model only"]
["To enable you to offer different increments of data and benefit from the lower buy rates of SIM Only plans to stack non- SIM Only deals for dealer / in house customers only the below rules will apply unless a standard tariff is selected."]
["All the below individually incur a £10 GP reduction. These GP reductions are stacked, SAQ funding will not be offered to negate these deductions and bring a deal back to standard margins."]
["·         If a tariff build is required for less than an initial 20 ctns contract."]
["·         If you offer more than £20 funding / hardware / credit on account on a SIMO plan."]
["·         If you bespoke a migration above 20 ctns that hasn’t been approved by O2."]
["·         If you offer up front Revenue Share, with less than £120 per connection GP."]
["·         If you offer more than 40% Revenue Share on rental or usage on a funded SIMO tariff."]
{"$rows_left_out":9}
{"sheet":"Conversion for PDF","index":8,"n_rows":32,"n_cols":25,"rows_kept":32,"cut":false,"hidden":true,"merged":[]}
["Tariff","Ctn. Type","Rental Per User","Qty","Total Cost per Month","Monthly Revenue Share","Standard Funding","Discretionary Funding","Revenue Share Over Term","Total Commission Over Term","Rev. Share on Tariff","Rev. Share on Std. Usage",null,{"$f":"IFERROR(INDEX(A$1:A$21,SMALL(IF($A$1:$A$21<>\"\",ROW(A$1:A$21)-ROW(A$1)+1),ROWS(A$1:A1))),\"\")","v":"Tariff"},{"$f":"IFERROR(INDEX(B$1:B$21,SMALL(IF($A$1:$A$21<>\"\",ROW(B$1:B$21)-ROW(B$1)+1),ROWS(B$1:B1))),\"\")","v":"Ctn. Type"},{"$f":"IFERROR(INDEX(C$1:C$21,SMALL(IF($A$1:$A$21<>\"\",ROW(C$1:C$21)-ROW(C$1)+1),ROWS(C$1:C1))),\"\")","v":"Rental Per User"},{"$f":"IFERROR(INDEX(D$1:D$21,SMALL(IF($A$1:$A$21<>\"\",ROW(D$1:D$21)-ROW(D$1)+1),ROWS(D$1:D1))),\"\")","v":"Qty"},{"$f":"IFERROR(INDEX(E$1:E$21,SMALL(IF($A$1:$A$21<>\"\",ROW(E$1:E$21)-ROW(E$1)+1),ROWS(E$1:E1))),\"\")","v":"Total Cost per Month"},{"$f":"IFERROR(INDEX(F$1:F$21,SMALL(IF($A$1:$A$21<>\"\",ROW(F$1:F$21)-ROW(F$1)+1),ROWS(F$1:F1))),\"\")","v":"Monthly Revenue Share"},{"$f":"IFERROR(INDEX(G$1:G$21,SMALL(IF($A$1:$A$21<>\"\",ROW(G$1:G$21)-ROW(G$1)+1),ROWS(G$1:G1))),\"\")","v":"Standard Funding"},{"$f":"IFERROR(INDEX(H$1:H$21,SMALL(IF($A$1:$A$21<>\"\",ROW(H$1:H$21)-ROW(H$1)+1),ROWS(H$1:H1))),\"\")","v":"Discretionary Funding"},{"$f":"IFERROR(INDEX(I$1:I$21,SMALL(IF($A$1:$A$21<>\"\",ROW(I$1:I$21)-ROW(I$1)+1),ROWS(I$1:I1))),\"\")","v":"Revenue Share Over Term"},{"$f":"IFERROR(INDEX(J$1:J$21,SMALL(IF($A$1:$A$21<>\"\",ROW(J$1:J$21)-ROW(J$1)+1),ROWS(J$1:J1))),\"\")","v":"Total Commission Over Term"},{"$f":"IFERROR(INDEX(K$1:K$21,SMALL(IF($A$1:$A$21<>\"\",ROW(K$1:K$21)-ROW(K$1)+1),ROWS(K$1:K1))),\"\")","v":"Rev. Share on Tariff"},{"$f":"IFERROR(INDEX(L$1:L$21,SMALL(IF($A$1:$A$21<>\"\",ROW(L$1:L$21)-ROW(L$1)+1),ROWS(L$1:L1))),\"\")","v":"Rev. Share on Std. Usage"}]
[{"$f":"'Internal Calc '!C12","v":""},{"$f":"'Deal Builder'!F21","v":"Choose.."},{"$f":"'Internal Calc '!E12","v":0},{"$f":"'Internal Calc '!D12","v":0},{"$f":"'Internal Calc '!F12","v":0},{"$f":"'Internal Calc '!G12","v":0},{"$f":"'Internal Calc '!#REF!","v":{"$error":"#REF!"}},{"$f":"'Internal Calc '!#REF!","v":{"$error":"#REF!"}},{"$f":"F2*'Deal Builder'!$F$13","v":{"$error":"#VALUE!"}},{"$f":"IFERROR(('Internal Calc '!G12*'Deal Builder'!$F$13)+'Internal Calc '!#REF!+'Internal Calc '!#REF!,0)","v":0},{"$f":"SUM('Deal Builder'!K21:K21)","v":0},{"$f":"SUM('Deal Builder'!#REF!)","v":{"$error":"#REF!"}},null,{"$f":"IFERROR(INDEX(A$1:A$21,SMALL(IF($A$1:$A$21<>\"\",ROW(A$1:A$21)-ROW(A$1)+1),ROWS(A$1:A2))),\"\")","v":"Grand Total"},{"$f":"IFERROR(INDEX(B$1:B$21,SMALL(IF($A$1:$A$21<>\"\",ROW(B$1:B$21)-ROW(B$1)+1),ROWS(B$1:B2))),\"\")","v":0},{"$f":"IFERROR(INDEX(C$1:C$21,SMALL(IF($A$1:$A$21<>\"\",ROW(C$1:C$21)-ROW(C$1)+1),ROWS(C$1:C2))),\"\")","v":0},{"$f":"IFERROR(INDEX(D$1:D$21,SMALL(IF($A$1:$A$21<>\"\",ROW(D$1:D$21)-ROW(D$1)+1),ROWS(D$1:D2))),\"\")","v":0},{"$f":"IFERROR(INDEX(E$1:E$21,SMALL(IF($A$1:$A$21<>\"\",ROW(E$1:E$21)-ROW(E$1)+1),ROWS(E$1:E2))),\"\")","v":0},{"$f":"IFERROR(INDEX(F$1:F$21,SMALL(IF($A$1:$A$21<>\"\",ROW(F$1:F$21)-ROW(F$1)+1),ROWS(F$1:F2))),\"\")","v":0},{"$f":"IFERROR(INDEX(G$1:G$21,SMALL(IF($A$1:$A$21<>\"\",ROW(G$1:G$21)-ROW(G$1)+1),ROWS(G$1:G2))),\"\")","v":""},{"$f":"IFERROR(INDEX(H$1:H$21,SMALL(IF($A$1:$A$21<>\"\",ROW(H$1:H$21)-ROW(H$1)+1),ROWS(H$1:H2))),\"\")","v":""},{"$f":"IFERROR(INDEX(I$1:I$21,SMALL(IF($A$1:$A$21<>\"\",ROW(I$1:I$21)-ROW(I$1)+1),ROWS(I$1:I2))),\"\")","v":""},{"$f":"IFERROR(INDEX(J$1:J$21,SMALL(IF($A$1:$A$21<>\"\",ROW(J$1:J$21)-ROW(J$1)+1),ROWS(J$1:J2))),\"\")","v":0},{"$f":"IFERROR(INDEX(K$1:K$21,SMALL(IF($A$1:$A$21<>\"\",ROW(K$1:K$21)-ROW(K$1)+1),ROWS(K$1:K2))),\"\")","v":0},{"$f":"IFERROR(INDEX(L$1:L$21,SMALL(IF($A$1:$A$21<>\"\",ROW(L$1:L$21)-ROW(L$1)+1),ROWS(L$1:L2))),\"\")","v":0}]
[{"$f":"'Internal Calc '!C13","v":""},{"$f":"'Deal Builder'!F22","v":"Choose.."},{"$f":"'Internal Calc '!E13","v":0},{"$f":"'Internal Calc '!D13","v":0},{"$f":"'Internal Calc '!F13","v":0},{"$f":"'Internal Calc '!G13","v":0},{"$f":"'Internal Calc '!#REF!","v":{"$error":"#REF!"}},{"$f":"'Internal Calc '!#REF!","v":{"$error":"#REF!"}},{"$f":"F3*'Deal Builder'!$F$13","v":{"$error":"#VALUE!"}},{"$f":"IFERROR(('Internal Calc '!G13*'Deal Builder'!$F$13)+'Internal Calc '!#REF!+'Internal Calc '!#REF!,0)","v":0},{"$f":"SUM('Deal Builder'!K22:K22)","v":0},{"$f":"SUM('Deal Builder'!#REF!)","v":{"$error":"#REF!"}},null,{"$f":"IFERROR(INDEX(A$1:A$21,SMALL(IF($A$1:$A$21<>\"\",ROW(A$1:A$21)-ROW(A$1)+1),ROWS(A$1:A3))),\"\")","v":""},{"$f":"IFERROR(INDEX(B$1:B$21,SMALL(IF($A$1:$A$21<>\"\",ROW(B$1:B$21)-ROW(B$1)+1),ROWS(B$1:B3))),\"\")","v":""},{"$f":"IFERROR(INDEX(C$1:C$21,SMALL(IF($A$1:$A$21<>\"\",ROW(C$1:C$21)-ROW(C$1)+1),ROWS(C$1:C3))),\"\")","v":""},{"$f":"IFERROR(INDEX(D$1:D$21,SMALL(IF($A$1:$A$21<>\"\",ROW(D$1:D$21)-ROW(D$1)+1),ROWS(D$1:D3))),\"\")","v":""},{"$f":"IFERROR(INDEX(E$1:E$21,SMALL(IF($A$1:$A$21<>\"\",ROW(E$1:E$21)-ROW(E$1)+1),ROWS(E$1:E3))),\"\")","v":""},{"$f":"IFERROR(INDEX(F$1:F$21,SMALL(IF($A$1:$A$21<>\"\",ROW(F$1:F$21)-ROW(F$1)+1),ROWS(F$1:F3))),\"\")","v":""},{"$f":"IFERROR(INDEX(G$1:G$21,SMALL(IF($A$1:$A$21<>\"\",ROW(G$1:G$21)-ROW(G$1)+1),ROWS(G$1:G3))),\"\")","v":""},{"$f":"IFERROR(INDEX(H$1:H$21,SMALL(IF($A$1:$A$21<>\"\",ROW(H$1:H$21)-ROW(H$1)+1),ROWS(H$1:H3))),\"\")","v":""},{"$f":"IFERROR(INDEX(I$1:I$21,SMALL(IF($A$1:$A$21<>\"\",ROW(I$1:I$21)-ROW(I$1)+1),ROWS(I$1:I3))),\"\")","v":""},{"$f":"IFERROR(INDEX(J$1:J$21,SMALL(IF($A$1:$A$21<>\"\",ROW(J$1:J$21)-ROW(J$1)+1),ROWS(J$1:J3))),\"\")","v":""},{"$f":"IFERROR(INDEX(K$1:K$21,SMALL(IF($A$1:$A$21<>\"\",ROW(K$1:K$21)-ROW(K$1)+1),ROWS(K$1:K3))),\"\")","v":""},{"$f":"IFERROR(INDEX(L$1:L$21,SMALL(IF($A$1:$A$21<>\"\",ROW(L$1:L$21)-ROW(L$1)+1),ROWS(L$1:L3))),\"\")","v":""}]
[{"$f":"'Internal Calc '!C14","v":""},{"$f":"'Deal Builder'!F23","v":"Choose.."},{"$f":"'Internal Calc '!E14","v":0},{"$f":"'Internal Calc '!D14","v":0},{"$f":"'Internal Calc '!F14","v":0},{"$f":"'Internal Calc '!G14","v":0},{"$f":"'Internal Calc '!#REF!","v":{"$error":"#REF!"}},{"$f":"'Internal Calc '!#REF!","v":{"$error":"#REF!"}},{"$f":"F4*'Deal Builder'!$F$13","v":{"$error":"#VALUE!"}},{"$f":"IFERROR(('Internal Calc '!G14*'Deal Builder'!$F$13)+'Internal Calc '!#REF!+'Internal Calc '!#REF!,0)","v":0},{"$f":"SUM('Deal Builder'!K23:K23)","v":0},{"$f":"SUM('Deal Builder'!#REF!)","v":{"$error":"#REF!"}},null,{"$f":"IFERROR(INDEX(A$1:A$21,SMALL(IF($A$1:$A$21<>\"\",ROW(A$1:A$21)-ROW(A$1)+1),ROWS(A$1:A4))),\"\")","v":""},{"$f":"IFERROR(INDEX(B$1:B$21,SMALL(IF($A$1:$A$21<>\"\",ROW(B$1:B$21)-ROW(B$1)+1),ROWS(B$1:B4))),\"\")","v":""},{"$f":"IFERROR(INDEX(C$1:C$21,SMALL(IF($A$1:$A$21<>\"\",ROW(C$1:C$21)-ROW(C$1)+1),ROWS(C$1:C4))),\"\")","v":""},{"$f":"IFERROR(INDEX(D$1:D$21,SMALL(IF($A$1:$A$21<>\"\",ROW(D$1:D$21)-ROW(D$1)+1),ROWS(D$1:D4))),\"\")","v":""},{"$f":"IFERROR(INDEX(E$1:E$21,SMALL(IF($A$1:$A$21<>\"\",ROW(E$1:E$21)-ROW(E$1)+1),ROWS(E$1:E4))),\"\")","v":""},{"$f":"IFERROR(INDEX(F$1:F$21,SMALL(IF($A$1:$A$21<>\"\",ROW(F$1:F$21)-ROW(F$1)+1),ROWS(F$1:F4))),\"\")","v":""},{"$f":"IFERROR(INDEX(G$1:G$21,SMALL(IF($A$1:$A$21<>\"\",ROW(G$1:G$21)-ROW(G$1)+1),ROWS(G$1:G4))),\"\")","v":""},{"$f":"IFERROR(INDEX(H$1:H$21,SMALL(IF($A$1:$A$21<>\"\",ROW(H$1:H$21)-ROW(H$1)+1),ROWS(H$1:H4))),\"\")","v":""},{"$f":"IFERROR(INDEX(I$1:I$21,SMALL(IF($A$1:$A$21<>\"\",ROW(I$1:I$21)-ROW(I$1)+1),ROWS(I$1:I4))),\"\")","v":""},{"$f":"IFERROR(INDEX(J$1:J$21,SMALL(IF($A$1:$A$21<>\"\",ROW(J$1:J$21)-ROW(J$1)+1),ROWS(J$1:J4))),\"\")","v":""},{"$f":"IFERROR(INDEX(K$1:K$21,SMALL(IF($A$1:$A$21<>\"\",ROW(K$1:K$21)-ROW(K$1)+1),ROWS(K$1:K4))),\"\")","v":""},{"$f":"IFERROR(INDEX(L$1:L$21,SMALL(IF($A$1:$A$21<>\"\",ROW(L$1:L$21)-ROW(L$1)+1),ROWS(L$1:L4))),\"\")","v":""}]
[{"$f":"'Internal Calc '!C15","v":""},{"$f":"'Deal Builder'!F24","v":"Choose.."},{"$f":"'Internal Calc '!E15","v":0},{"$f":"'Internal Calc '!D15","v":0},{"$f":"'Internal Calc '!F15","v":0},{"$f":"'Internal Calc '!G15","v":0},{"$f":"'Internal Calc '!#REF!","v":{"$error":"#REF!"}},{"$f":"'Internal Calc '!#REF!","v":{"$error":"#REF!"}},{"$f":"F5*'Deal Builder'!$F$13","v":{"$error":"#VALUE!"}},{"$f":"IFERROR(('Internal Calc '!G15*'Deal Builder'!$F$13)+'Internal Calc '!#REF!+'Internal Calc '!#REF!,0)","v":0},{"$f":"SUM('Deal Builder'!K24:K24)","v":0},{"$f":"SUM('Deal Builder'!#REF!)","v":{"$error":"#REF!"}},null,{"$f":"IFERROR(INDEX(A$1:A$21,SMALL(IF($A$1:$A$21<>\"\",ROW(A$1:A$21)-ROW(A$1)+1),ROWS(A$1:A5))),\"\")","v":""},{"$f":"IFERROR(INDEX(B$1:B$21,SMALL(IF($A$1:$A$21<>\"\",ROW(B$1:B$21)-ROW(B$1)+1),ROWS(B$1:B5))),\"\")","v":""},{"$f":"IFERROR(INDEX(C$1:C$21,SMALL(IF($A$1:$A$21<>\"\",ROW(C$1:C$21)-ROW(C$1)+1),ROWS(C$1:C5))),\"\")","v":""},{"$f":"IFERROR(INDEX(D$1:D$21,SMALL(IF($A$1:$A$21<>\"\",ROW(D$1:D$21)-ROW(D$1)+1),ROWS(D$1:D5))),\"\")","v":""},{"$f":"IFERROR(INDEX(E$1:E$21,SMALL(IF($A$1:$A$21<>\"\",ROW(E$1:E$21)-ROW(E$1)+1),ROWS(E$1:E5))),\"\")","v":""},{"$f":"IFERROR(INDEX(F$1:F$21,SMALL(IF($A$1:$A$21<>\"\",ROW(F$1:F$21)-ROW(F$1)+1),ROWS(F$1:F5))),\"\")","v":""},{"$f":"IFERROR(INDEX(G$1:G$21,SMALL(IF($A$1:$A$21<>\"\",ROW(G$1:G$21)-ROW(G$1)+1),ROWS(G$1:G5))),\"\")","v":""},{"$f":"IFERROR(INDEX(H$1:H$21,SMALL(IF($A$1:$A$21<>\"\",ROW(H$1:H$21)-ROW(H$1)+1),ROWS(H$1:H5))),\"\")","v":""},{"$f":"IFERROR(INDEX(I$1:I$21,SMALL(IF($A$1:$A$21<>\"\",ROW(I$1:I$21)-ROW(I$1)+1),ROWS(I$1:I5))),\"\")","v":""},{"$f":"IFERROR(INDEX(J$1:J$21,SMALL(IF($A$1:$A$21<>\"\",ROW(J$1:J$21)-ROW(J$1)+1),ROWS(J$1:J5))),\"\")","v":""},{"$f":"IFERROR(INDEX(K$1:K$21,SMALL(IF($A$1:$A$21<>\"\",ROW(K$1:K$21)-ROW(K$1)+1),ROWS(K$1:K5))),\"\")","v":""},{"$f":"IFERROR(INDEX(L$1:L$21,SMALL(IF($A$1:$A$21<>\"\",ROW(L$1:L$21)-ROW(L$1)+1),ROWS(L$1:L5))),\"\")","v":""}]
[{"$f":"'Internal Calc '!C16","v":""},{"$f":"'Deal Builder'!F25","v":"Choose.."},{"$f":"'Internal Calc '!E16","v":0},{"$f":"'Internal Calc '!D16","v":0},{"$f":"'Internal Calc '!F16","v":0},{"$f":"'Internal Calc '!G16","v":0},{"$f":"'Internal Calc '!#REF!","v":{"$error":"#REF!"}},{"$f":"'Internal Calc '!#REF!","v":{"$error":"#REF!"}},{"$f":"F6*'Deal Builder'!$F$13","v":{"$error":"#VALUE!"}},{"$f":"IFERROR(('Internal Calc '!G16*'Deal Builder'!$F$13)+'Internal Calc '!#REF!+'Internal Calc '!#REF!,0)","v":0},{"$f":"SUM('Deal Builder'!K25:K25)","v":0},{"$f":"SUM('Deal Builder'!#REF!)","v":{"$error":"#REF!"}},null,{"$f":"IFERROR(INDEX(A$1:A$21,SMALL(IF($A$1:$A$21<>\"\",ROW(A$1:A$21)-ROW(A$1)+1),ROWS(A$1:A6))),\"\")","v":""},{"$f":"IFERROR(INDEX(B$1:B$21,SMALL(IF($A$1:$A$21<>\"\",ROW(B$1:B$21)-ROW(B$1)+1),ROWS(B$1:B6))),\"\")","v":""},{"$f":"IFERROR(INDEX(C$1:C$21,SMALL(IF($A$1:$A$21<>\"\",ROW(C$1:C$21)-ROW(C$1)+1),ROWS(C$1:C6))),\"\")","v":""},{"$f":"IFERROR(INDEX(D$1:D$21,SMALL(IF($A$1:$A$21<>\"\",ROW(D$1:D$21)-ROW(D$1)+1),ROWS(D$1:D6))),\"\")","v":""},{"$f":"IFERROR(INDEX(E$1:E$21,SMALL(IF($A$1:$A$21<>\"\",ROW(E$1:E$21)-ROW(E$1)+1),ROWS(E$1:E6))),\"\")","v":""},{"$f":"IFERROR(INDEX(F$1:F$21,SMALL(IF($A$1:$A$21<>\"\",ROW(F$1:F$21)-ROW(F$1)+1),ROWS(F$1:F6))),\"\")","v":""},{"$f":"IFERROR(INDEX(G$1:G$21,SMALL(IF($A$1:$A$21<>\"\",ROW(G$1:G$21)-ROW(G$1)+1),ROWS(G$1:G6))),\"\")","v":""},{"$f":"IFERROR(INDEX(H$1:H$21,SMALL(IF($A$1:$A$21<>\"\",ROW(H$1:H$21)-ROW(H$1)+1),ROWS(H$1:H6))),\"\")","v":""},{"$f":"IFERROR(INDEX(I$1:I$21,SMALL(IF($A$1:$A$21<>\"\",ROW(I$1:I$21)-ROW(I$1)+1),ROWS(I$1:I6))),\"\")","v":""},{"$f":"IFERROR(INDEX(J$1:J$21,SMALL(IF($A$1:$A$21<>\"\",ROW(J$1:J$21)-ROW(J$1)+1),ROWS(J$1:J6))),\"\")","v":""},{"$f":"IFERROR(INDEX(K$1:K$21,SMALL(IF($A$1:$A$21<>\"\",ROW(K$1:K$21)-ROW(K$1)+1),ROWS(K$1:K6))),\"\")","v":""},{"$f":"IFERROR(INDEX(L$1:L$21,SMALL(IF($A$1:$A$21<>\"\",ROW(L$1:L$21)-ROW(L$1)+1),ROWS(L$1:L6))),\"\")","v":""}]
[{"$f":"'Internal Calc '!C17","v":""},{"$f":"'Deal Builder'!F26","v":"Choose.."},{"$f":"'Internal Calc '!E17","v":0},{"$f":"'Internal Calc '!D17","v":0},{"$f":"'Internal Calc '!F17","v":0},{"$f":"'Internal Calc '!G17","v":0},{"$f":"'Internal Calc '!#REF!","v":{"$error":"#REF!"}},{"$f":"'Internal Calc '!#REF!","v":{"$error":"#REF!"}},{"$f":"F7*'Deal Builder'!$F$13","v":{"$error":"#VALUE!"}},{"$f":"IFERROR(('Internal Calc '!G17*'Deal Builder'!$F$13)+'Internal Calc '!#REF!+'Internal Calc '!#REF!,0)","v":0},{"$f":"SUM('Deal Builder'!K26:K26)","v":0},{"$f":"SUM('Deal Builder'!#REF!)","v":{"$error":"#REF!"}},null,{"$f":"IFERROR(INDEX(A$1:A$21,SMALL(IF($A$1:$A$21<>\"\",ROW(A$1:A$21)-ROW(A$1)+1),ROWS(A$1:A7))),\"\")","v":""},{"$f":"IFERROR(INDEX(B$1:B$21,SMALL(IF($A$1:$A$21<>\"\",ROW(B$1:B$21)-ROW(B$1)+1),ROWS(B$1:B7))),\"\")","v":""},{"$f":"IFERROR(INDEX(C$1:C$21,SMALL(IF($A$1:$A$21<>\"\",ROW(C$1:C$21)-ROW(C$1)+1),ROWS(C$1:C7))),\"\")","v":""},{"$f":"IFERROR(INDEX(D$1:D$21,SMALL(IF($A$1:$A$21<>\"\",ROW(D$1:D$21)-ROW(D$1)+1),ROWS(D$1:D7))),\"\")","v":""},{"$f":"IFERROR(INDEX(E$1:E$21,SMALL(IF($A$1:$A$21<>\"\",ROW(E$1:E$21)-ROW(E$1)+1),ROWS(E$1:E7))),\"\")","v":""},{"$f":"IFERROR(INDEX(F$1:F$21,SMALL(IF($A$1:$A$21<>\"\",ROW(F$1:F$21)-ROW(F$1)+1),ROWS(F$1:F7))),\"\")","v":""},{"$f":"IFERROR(INDEX(G$1:G$21,SMALL(IF($A$1:$A$21<>\"\",ROW(G$1:G$21)-ROW(G$1)+1),ROWS(G$1:G7))),\"\")","v":""},{"$f":"IFERROR(INDEX(H$1:H$21,SMALL(IF($A$1:$A$21<>\"\",ROW(H$1:H$21)-ROW(H$1)+1),ROWS(H$1:H7))),\"\")","v":""},{"$f":"IFERROR(INDEX(I$1:I$21,SMALL(IF($A$1:$A$21<>\"\",ROW(I$1:I$21)-ROW(I$1)+1),ROWS(I$1:I7))),\"\")","v":""},{"$f":"IFERROR(INDEX(J$1:J$21,SMALL(IF($A$1:$A$21<>\"\",ROW(J$1:J$21)-ROW(J$1)+1),ROWS(J$1:J7))),\"\")","v":""},{"$f":"IFERROR(INDEX(K$1:K$21,SMALL(IF($A$1:$A$21<>\"\",ROW(K$1:K$21)-ROW(K$1)+1),ROWS(K$1:K7))),\"\")","v":""},{"$f":"IFERROR(INDEX(L$1:L$21,SMALL(IF($A$1:$A$21<>\"\",ROW(L$1:L$21)-ROW(L$1)+1),ROWS(L$1:L7))),\"\")","v":""}]
[{"$f":"'Internal Calc '!C18","v":""},{"$f":"'Deal Builder'!F27","v":"Choose.."},{"$f":"'Internal Calc '!E18","v":0},{"$f":"'Internal Calc '!D18","v":0},{"$f":"'Internal Calc '!F18","v":0},{"$f":"'Internal Calc '!G18","v":0},{"$f":"'Internal Calc '!#REF!","v":{"$error":"#REF!"}},{"$f":"'Internal Calc '!#REF!","v":{"$error":"#REF!"}},{"$f":"F8*'Deal Builder'!$F$13","v":{"$error":"#VALUE!"}},{"$f":"IFERROR(('Internal Calc '!G18*'Deal Builder'!$F$13)+'Internal Calc '!#REF!+'Internal Calc '!#REF!,0)","v":0},{"$f":"SUM('Deal Builder'!K27:K27)","v":0},{"$f":"SUM('Deal Builder'!#REF!)","v":{"$error":"#REF!"}},null,{"$f":"IFERROR(INDEX(A$1:A$21,SMALL(IF($A$1:$A$21<>\"\",ROW(A$1:A$21)-ROW(A$1)+1),ROWS(A$1:A8))),\"\")","v":""},{"$f":"IFERROR(INDEX(B$1:B$21,SMALL(IF($A$1:$A$21<>\"\",ROW(B$1:B$21)-ROW(B$1)+1),ROWS(B$1:B8))),\"\")","v":""},{"$f":"IFERROR(INDEX(C$1:C$21,SMALL(IF($A$1:$A$21<>\"\",ROW(C$1:C$21)-ROW(C$1)+1),ROWS(C$1:C8))),\"\")","v":""},{"$f":"IFERROR(INDEX(D$1:D$21,SMALL(IF($A$1:$A$21<>\"\",ROW(D$1:D$21)-ROW(D$1)+1),ROWS(D$1:D8))),\"\")","v":""},{"$f":"IFERROR(INDEX(E$1:E$21,SMALL(IF($A$1:$A$21<>\"\",ROW(E$1:E$21)-ROW(E$1)+1),ROWS(E$1:E8))),\"\")","v":""},{"$f":"IFERROR(INDEX(F$1:F$21,SMALL(IF($A$1:$A$21<>\"\",ROW(F$1:F$21)-ROW(F$1)+1),ROWS(F$1:F8))),\"\")","v":""},{"$f":"IFERROR(INDEX(G$1:G$21,SMALL(IF($A$1:$A$21<>\"\",ROW(G$1:G$21)-ROW(G$1)+1),ROWS(G$1:G8))),\"\")","v":""},{"$f":"IFERROR(INDEX(H$1:H$21,SMALL(IF($A$1:$A$21<>\"\",ROW(H$1:H$21)-ROW(H$1)+1),ROWS(H$1:H8))),\"\")","v":""},{"$f":"IFERROR(INDEX(I$1:I$21,SMALL(IF($A$1:$A$21<>\"\",ROW(I$1:I$21)-ROW(I$1)+1),ROWS(I$1:I8))),\"\")","v":""},{"$f":"IFERROR(INDEX(J$1:J$21,SMALL(IF($A$1:$A$21<>\"\",ROW(J$1:J$21)-ROW(J$1)+1),ROWS(J$1:J8))),\"\")","v":""},{"$f":"IFERROR(INDEX(K$1:K$21,SMALL(IF($A$1:$A$21<>\"\",ROW(K$1:K$21)-ROW(K$1)+1),ROWS(K$1:K8))),\"\")","v":""},{"$f":"IFERROR(INDEX(L$1:L$21,SMALL(IF($A$1:$A$21<>\"\",ROW(L$1:L$21)-ROW(L$1)+1),ROWS(L$1:L8))),\"\")","v":""}]
{"$rows_left_out":25}
{"sheet":"Drop Downs","index":9,"n_rows":15,"n_cols":18,"rows_kept":15,"cut":false,"hidden":true,"merged":[]}
["Cell Reference"]
["Name Ref","TermLength","yesno","twelvetariffNetwork","twentyfourtariffNetwork","thirtytariffNetwork","O2twelvetariff","O2twentyfourtariff/O2thirtytariff","tsosu","tmbb","tfsosu","tfmbb","Twentyotwobo","Twelveotwobo/Oneotwobo","rd","rowm","ic","CBMName"]
[]
[null,"Choose..","Choose..","Choose..","Choose..","Choose..","Choose..","Choose..","Choose..","Choose..","Choose..","Choose..","Choose..","Choose..","Choose..","Choose..","Choose..","Choose.."]
[null,12,"Yes","O2","O2","O2","Sim Only Single User","Sim Only Single User","Small Biz SO 300MB 12M RRP","Mobile Broadband 1GB 12M RRP","Small Biz SO 300MB 24M RRP","Mobile Broadband 1GB 24M RRP","Roaming Data","Roaming Data","ROW Data 500MB","ROW 250 mins","Int. Caller 120 Mins","Ian Davis "]
[null,24,"No",null,null,null,"Mobile Broadband","Mobile Broadband","Small Biz SO 500MB 12M RRP","Mobile Broadband 2GB 12M RRP","Small Biz SO 500MB 24M RRP","Mobile Broadband 2GB 24M RRP","ROW Minutes","ROW Minutes","ROW Data 1GB","ROW 500 mins","Int. Caller 500 Mins","Rob Foster"]
[null,36,null,null,null,null,null,null,"Small Biz SO 2GB 12M RRP","Mobile Broadband 4GB 12M RRP","Small Biz SO 2GB 24M RRP","Mobile Broadband 4GB 24M RRP","International Caller","International Caller",null,null,null,"Anton Le Saux"]
[null,null,null,null,null,null,null,null,"Small Biz SO 3GB 12M RRP","Mobile Broadband 8GB 12M RRP","Small Biz SO 3GB 24M RRP","Mobile Broadband 8GB 24M RRP",null,null,null,null,null,"Ben Ofosu"]
{"$rows_left_out":8}
{"sheet":"Lookups","index":10,"n_rows":25,"n_cols":16,"rows_kept":25,"cut":false,"hidden":true,"merged":[]}
["Cell Reference"]
[]
[null,1,"onetariff",null,null,"12Sim Only Single User","tsosu",null,1,"One",null,"O2","otwo",null,"Small Biz Shared Data","sbsd"]
[null,12,"twelvetariff",null,null,"12Sim Only Adjusted Rev Share","tsoad",null,12,"Twelve",null,"Vodafone","vodafone",null,"Shared Minutes","sm"]
[null,24,"twentyfourtariff",null,null,"12Mobile Broadband","tmbb",null,24,"Twenty",null,null,null,null,"Shared Texts","st"]
[null,36,"thirtytariff",null,null,"24Sim Only Single User","tfsosu",null,null,null,null,null,null,null,"Individual Data","id"]
[null,null,null,null,null,"24Sim Only Adjusted Rev Share","tfsoad",null,null,null,null,null,null,null,"Shared Data","sd"]
[null,null,null,null,null,"24Single User","tfsu",null,null,null,null,null,null,null,"Individual Topup","it"]
{"$rows_left_out":18}
{"sheet":"Pricing","index":11,"n_rows":43,"n_cols":8,"rows_kept":43,"cut":false,"hidden":true,"merged":[]}
["Tariff","Type","Data","Term","Standard Sell","Overage Revenue","Commission %","Usage Commission %"]
["Small Biz SO 300MB 12M RRP","RRP","300MB","12M",11.4,4.5,0.4,0.5]
["Small Biz SO 500MB 12M RRP","RRP","500MB","12M",13.8,4.5,0.4,0.5]
["Small Biz SO 2GB 12M RRP","RRP","2GB","12M",17,4.5,0.4,0.5]
["Small Biz SO 3GB 12M RRP","RRP","3GB","12M",17,4.5,0.4,0.5]
["Small Biz SO 5GB 12M RRP","RRP","5GB","12M",19,4.5,0.4,0.5]
["Small Biz SO 8GB 12M RRP","RRP","8GB","12M",22,4.5,0.45,0.5]
["Small Biz SO 16GB 12M RRP","RRP","16GB","12M",24,4.5,0.45,0.5]
{"$rows_left_out":35}