{"text_format":"1","workbook":"xlsx","n_sheets":11,"sheets":["Instructions","Deal Builder","Internal Calc ","PDF Generator","New PDF","Resign Rules","Aggregated Data Rules","Conversion for PDF","Lookups","Drop Downs","Pricing"],"not_rendered":{"charts":0,"images":3,"macros":1,"external_links":0,"defined_names":62,"comments":0,"pivot_tables":0},"unopened":[],"bounds":{"document_bytes":16777216,"sheet_cells":100000,"rows_first":2000,"rows_last":500,"rows_between":2000,"halvings":0,"cell_chars":16384,"cell_head_chars":4096},"cells_cut":0,"cells_raw":0,"read":"whole","date_system":"1900"}

{"sheet":"Instructions","index":0,"n_rows":5,"n_cols":7,"rows_kept":5,"cut":false,"hidden":false,"merged":[]}
[null,null,null,null,null,null,"Instructions "]
[]
[]
["Please fill out the Mandatory boxes F3-F15 "]
["Network code will auto populate when a quantity is entered"]

{"sheet":"Deal Builder","index":1,"n_rows":42,"n_cols":20,"rows_kept":42,"cut":false,"hidden":false,"merged":[[0,3,0,16],[6,3,6,4],[6,5,6,6],[16,3,16,5],[30,3,30,5],[14,3,14,4],[2,3,2,4],[4,3,4,4],[4,5,4,6],[30,14,30,16]]}
[null,null,null,"Zest4 Deal Calculator v3.1.2",null,null,null,null,null,null,null,null,null,null,null,null,null,null,null,{"$f":"COUNTIF(#REF!,\"YES\")+COUNTIF(#REF!,\"YES\")","v":{"$error":"#REF!"}}]
[]
[null,null,null,"CBM Name: ",null,"Choose.."]
[]
[null,null,null,"Customer Name:"]
[]
[null,null,null,"Partner Name:"]
[]
[null,null,null,null,"Partner Code:"]
[]
{"$rows_left_out":33}
{"sheet":"Internal Calc ","index":2,"n_rows":29,"n_cols":13,"rows_kept":29,"cut":false,"hidden":false,"merged":[[28,7,28,10],[27,3,27,6],[28,3,28,6],[21,0,21,1],[22,0,22,1],[23,0,23,1],[24,0,24,1],[25,0,25,1],[11,0,11,1],[12,0,12,1],[5,0,5,1],[6,0,6,1],[26,0,26,1],[13,0,13,1],[14,0,14,1],[15,0,15,1],[20,0,20,1],[8,0,8,1],[16,0,16,1],[17,0,17,1],[18,0,18,1],[19,0,19,1],[10,0,10,1],[0,0,0,11],[2,0,2,1],[3,0,3,1],[4,0,4,1],[7,0,7,1]]}
["Zest4 Deal Sheet"]
[]
["Partner name ",null,{"$f":"IF('Deal Builder'!F7=\"\",\"\",'Deal Builder'!F7)","v":""}]
["Partner Code",null,{"$f":"IF('Deal Builder'!F9=\"\",\"\",'Deal Builder'!F9)","v":""}]
["Customer name ",null,{"$f":"IF('Deal Builder'!F5=\"\",\"\",'Deal Builder'!F5)","v":""}]
["Total Voice Connections",null,{"$f":"IF(SUM('Deal Builder'!D21:D28)=0,\"\",SUM('Deal Builder'!D21:D28))","v":""}]
["Your Deal Reference",null,{"$f":"IF('Deal Builder'!F11=\"\",\"\",'Deal Builder'!F11)","v":""}]
["Estimated Customer Monthly Billing",null,{"$f":"I28","v":0}]
["Deal Profit",null,{"$f":"L28","v":0}]
[]
{"$rows_left_out":20}
{"sheet":"PDF Generator","index":3,"n_rows":26,"n_cols":5,"rows_kept":26,"cut":false,"hidden":true,"merged":[]}
[]
["Partner name ",{"$f":"'Internal Calc '!C3","v":""}]
["Partner Code",{"$f":"'Internal Calc '!C4","v":""}]
["Customer name ",{"$f":"'Internal Calc '!C5","v":""}]
["Total Voice Connections",{"$f":"'Internal Calc '!C6","v":""}]
["Your Deal Reference",{"$f":"'Internal Calc '!C7","v":""}]
["Estimated Customer Monthly Billing",{"$f":"'Internal Calc '!C8","v":0}]
["Bonuses on Month One",{"$f":"'Internal Calc '!#REF!","v":{"$error":"#REF!"}}]
[]
["Tariff","Quanitity","Total monthly cost","Funding ","Margin"]
{"$rows_left_out":17}
{"sheet":"New PDF","index":4,"n_rows":31,"n_cols":5,"rows_kept":31,"cut":false,"hidden":false,"merged":[[5,0,5,4],[32,0,32,4],[30,0,31,4]]}
[]
[]
[]
[]
[]
[{"$f":"\"Deal Summary For: \"&'Deal Builder'!F5","v":"Deal Summary For: "}]
[{"$f":"\"Partner Name: \"&'Deal Builder'!F7","v":"Partner Name: "},null,null,null,"ZES"]
[{"$f":"\"Contract Term: \"&'Deal Builder'!F13&IF('Deal Builder'!F13=1,\" Month\",\" Months\")","v":"Contract Term: Choose.. Months"},null,null,"Deal Reference:","ZES8882"]
[]
[]
{"$rows_left_out":22}
{"sheet":"Resign Rules","index":5,"n_rows":43,"n_cols":1,"rows_kept":43,"cut":false,"hidden":true,"merged":[]}
[]
[]
[]
[]
[]
[]
["Update MF 10/01/18"]
["I think there has been some confusion on rules around migrating to the new SIM only O2 plans – please see below the rules that need to be applied:"]
["1)      They must have served their initial contract term on either standard 24 month plans or current Sim only 30 day plans and pay a £30 migration fee. (No resign required)"]
["2)      If they wish to resign then they can move to one of the new plans ( standard early resign rules apply) and no migration fee is chargeable if they resign for a new term of 24 months (last 3 months of contract, 24 month extension)"]
{"$rows_left_out":34}
{"sheet":"Aggregated Data Rules","index":6,"n_rows":23,"n_cols":1,"rows_kept":23,"cut":false,"hidden":true,"merged":[]}
["Aggregating Small Biz Sim Only Tariffs to avoid bill shock."]
["To give you the ability to compete with other offerings in the market we want to make available the option to build bespoke deals around using small biz tariffs and stacking them to create shared data bundles."]
["This is not a simple offering in the background and it presents some operational and commercial challenges.  We therefore need to have rules in place as to where and how this is offered and a clear process to ensure it is delivered to the customer/reseller correctly and declared to O2 correctly."]
["The rules are outlined below:"]
["1)      You need to get commercial sign off for each stackable shared biz opportunity"]
["2)      We will only offer this tariff for 50 users or over (amended to 20)"]
["3)      All users must be on the same small biz tariff – there are no mix and match options available e.g. all users on Small Biz 2GB"]
["4)      These tariffs are available for new / mig only"]
["5)      It is expected that these will be sold on a 24 month term"]
["6)      Each user is charged £2 RRP, £1 Reseller rate extra on top of the tariff base price per month for sharing the data.  This extra £2/1 rental is not counted towards GP as it is to cover the additional data declarations we may need to declare to O2 if an individual user goes over their data allowance"]
{"$rows_left_out":14}
{"sheet":"Conversion for PDF","index":7,"n_rows":20,"n_cols":13,"rows_kept":20,"cut":false,"hidden":true,"merged":[]}
["Tariff","Quantity","Monthly Cost Per Line Per Month","Total Cost Per Month","Funding Per Line","Total Funding",null,null,{"$f":"IFERROR(INDEX(A$1:A$20,SMALL(IF($A$1:$A$20<>\"\",ROW(A$1:A$20)-ROW(A$1)+1),ROWS(A$1:A1))),\"\")","v":"Tariff"},{"$f":"IFERROR(INDEX(B$1:B$20,SMALL(IF($A$1:$A$20<>\"\",ROW(B$1:B$20)-ROW(B$1)+1),ROWS(B$1:B1))),\"\")","v":"Quantity"},{"$f":"IFERROR(INDEX(C$1:C$20,SMALL(IF($A$1:$A$20<>\"\",ROW(C$1:C$20)-ROW(C$1)+1),ROWS(C$1:C1))),\"\")","v":"Monthly Cost Per Line Per Month"},{"$f":"IFERROR(INDEX(E$1:E$20,SMALL(IF($A$1:$A$20<>\"\",ROW(E$1:E$20)-ROW(E$1)+1),ROWS(E$1:E1))),\"\")","v":"Funding Per Line"},{"$f":"IFERROR(INDEX(F$1:F$20,SMALL(IF($A$1:$A$20<>\"\",ROW(F$1:F$20)-ROW(F$1)+1),ROWS(F$1:F1))),\"\")","v":"Total Funding"}]
[{"$f":"'Internal Calc '!C12","v":""},{"$f":"'Internal Calc '!E12","v":0},{"$f":"'Deal Builder'!L21","v":0},{"$f":"C2*B2","v":0},{"$f":"'Deal Builder'!N21","v":0},{"$f":"E2*B2","v":0},null,null,{"$f":"IFERROR(INDEX(A$1:A$20,SMALL(IF($A$1:$A$20<>\"\",ROW(A$1:A$20)-ROW(A$1)+1),ROWS(A$1:A2))),\"\")","v":""},{"$f":"IFERROR(INDEX(B$1:B$20,SMALL(IF($A$1:$A$20<>\"\",ROW(B$1:B$20)-ROW(B$1)+1),ROWS(B$1:B2))),\"\")","v":""},{"$f":"IFERROR(INDEX(C$1:C$20,SMALL(IF($A$1:$A$20<>\"\",ROW(C$1:C$20)-ROW(C$1)+1),ROWS(C$1:C2))),\"\")","v":""},{"$f":"IFERROR(INDEX(E$1:E$20,SMALL(IF($A$1:$A$20<>\"\",ROW(E$1:E$20)-ROW(E$1)+1),ROWS(E$1:E2))),\"\")","v":""},{"$f":"IFERROR(INDEX(F$1:F$20,SMALL(IF($A$1:$A$20<>\"\",ROW(F$1:F$20)-ROW(F$1)+1),ROWS(F$1:F2))),\"\")","v":""}]
[{"$f":"'Internal Calc '!C13","v":""},{"$f":"'Internal Calc '!E13","v":0},{"$f":"'Deal Builder'!L22","v":0},{"$f":"C3*B3","v":0},{"$f":"'Deal Builder'!N22","v":0},{"$f":"E3*B3","v":0},null,null,{"$f":"IFERROR(INDEX(A$1:A$20,SMALL(IF($A$1:$A$20<>\"\",ROW(A$1:A$20)-ROW(A$1)+1),ROWS(A$1:A3))),\"\")","v":""},{"$f":"IFERROR(INDEX(B$1:B$20,SMALL(IF($A$1:$A$20<>\"\",ROW(B$1:B$20)-ROW(B$1)+1),ROWS(B$1:B3))),\"\")","v":""},{"$f":"IFERROR(INDEX(C$1:C$20,SMALL(IF($A$1:$A$20<>\"\",ROW(C$1:C$20)-ROW(C$1)+1),ROWS(C$1:C3))),\"\")","v":""},{"$f":"IFERROR(INDEX(E$1:E$20,SMALL(IF($A$1:$A$20<>\"\",ROW(E$1:E$20)-ROW(E$1)+1),ROWS(E$1:E3))),\"\")","v":""},{"$f":"IFERROR(INDEX(F$1:F$20,SMALL(IF($A$1:$A$20<>\"\",ROW(F$1:F$20)-ROW(F$1)+1),ROWS(F$1:F3))),\"\")","v":""}]
[{"$f":"'Internal Calc '!C14","v":""},{"$f":"'Internal Calc '!E14","v":0},{"$f":"'Deal Builder'!L23","v":0},0,{"$f":"'Deal Builder'!N23","v":0},0,null,null,{"$f":"IFERROR(INDEX(A$1:A$20,SMALL(IF($A$1:$A$20<>\"\",ROW(A$1:A$20)-ROW(A$1)+1),ROWS(A$1:A4))),\"\")","v":""},{"$f":"IFERROR(INDEX(B$1:B$20,SMALL(IF($A$1:$A$20<>\"\",ROW(B$1:B$20)-ROW(B$1)+1),ROWS(B$1:B4))),\"\")","v":""},{"$f":"IFERROR(INDEX(C$1:C$20,SMALL(IF($A$1:$A$20<>\"\",ROW(C$1:C$20)-ROW(C$1)+1),ROWS(C$1:C4))),\"\")","v":""},{"$f":"IFERROR(INDEX(E$1:E$20,SMALL(IF($A$1:$A$20<>\"\",ROW(E$1:E$20)-ROW(E$1)+1),ROWS(E$1:E4))),\"\")","v":""},{"$f":"IFERROR(INDEX(F$1:F$20,SMALL(IF($A$1:$A$20<>\"\",ROW(F$1:F$20)-ROW(F$1)+1),ROWS(F$1:F4))),\"\")","v":""}]
[{"$f":"'Internal Calc '!C15","v":""},{"$f":"'Internal Calc '!E15","v":0},{"$f":"'Deal Builder'!L24","v":0},0,{"$f":"'Deal Builder'!N24","v":0},0,null,null,{"$f":"IFERROR(INDEX(A$1:A$20,SMALL(IF($A$1:$A$20<>\"\",ROW(A$1:A$20)-ROW(A$1)+1),ROWS(A$1:A5))),\"\")","v":""},{"$f":"IFERROR(INDEX(B$1:B$20,SMALL(IF($A$1:$A$20<>\"\",ROW(B$1:B$20)-ROW(B$1)+1),ROWS(B$1:B5))),\"\")","v":""},{"$f":"IFERROR(INDEX(C$1:C$20,SMALL(IF($A$1:$A$20<>\"\",ROW(C$1:C$20)-ROW(C$1)+1),ROWS(C$1:C5))),\"\")","v":""},{"$f":"IFERROR(INDEX(E$1:E$20,SMALL(IF($A$1:$A$20<>\"\",ROW(E$1:E$20)-ROW(E$1)+1),ROWS(E$1:E5))),\"\")","v":""},{"$f":"IFERROR(INDEX(F$1:F$20,SMALL(IF($A$1:$A$20<>\"\",ROW(F$1:F$20)-ROW(F$1)+1),ROWS(F$1:F5))),\"\")","v":""}]
[{"$f":"'Internal Calc '!C16","v":""},{"$f":"'Internal Calc '!E16","v":0},{"$f":"'Deal Builder'!L25","v":0},0,{"$f":"'Deal Builder'!N25","v":0},0,null,null,{"$f":"IFERROR(INDEX(A$1:A$20,SMALL(IF($A$1:$A$20<>\"\",ROW(A$1:A$20)-ROW(A$1)+1),ROWS(A$1:A6))),\"\")","v":""},{"$f":"IFERROR(INDEX(B$1:B$20,SMALL(IF($A$1:$A$20<>\"\",ROW(B$1:B$20)-ROW(B$1)+1),ROWS(B$1:B6))),\"\")","v":""},{"$f":"IFERROR(INDEX(C$1:C$20,SMALL(IF($A$1:$A$20<>\"\",ROW(C$1:C$20)-ROW(C$1)+1),ROWS(C$1:C6))),\"\")","v":""},{"$f":"IFERROR(INDEX(E$1:E$20,SMALL(IF($A$1:$A$20<>\"\",ROW(E$1:E$20)-ROW(E$1)+1),ROWS(E$1:E6))),\"\")","v":""},{"$f":"IFERROR(INDEX(F$1:F$20,SMALL(IF($A$1:$A$20<>\"\",ROW(F$1:F$20)-ROW(F$1)+1),ROWS(F$1:F6))),\"\")","v":""}]
[{"$f":"'Internal Calc '!C17","v":""},{"$f":"'Internal Calc '!E17","v":0},{"$f":"'Deal Builder'!L26","v":0},0,{"$f":"'Deal Builder'!N26","v":0},0,null,null,{"$f":"IFERROR(INDEX(A$1:A$20,SMALL(IF($A$1:$A$20<>\"\",ROW(A$1:A$20)-ROW(A$1)+1),ROWS(A$1:A7))),\"\")","v":""},{"$f":"IFERROR(INDEX(B$1:B$20,SMALL(IF($A$1:$A$20<>\"\",ROW(B$1:B$20)-ROW(B$1)+1),ROWS(B$1:B7))),\"\")","v":""},{"$f":"IFERROR(INDEX(C$1:C$20,SMALL(IF($A$1:$A$20<>\"\",ROW(C$1:C$20)-ROW(C$1)+1),ROWS(C$1:C7))),\"\")","v":""},{"$f":"IFERROR(INDEX(E$1:E$20,SMALL(IF($A$1:$A$20<>\"\",ROW(E$1:E$20)-ROW(E$1)+1),ROWS(E$1:E7))),\"\")","v":""},{"$f":"IFERROR(INDEX(F$1:F$20,SMALL(IF($A$1:$A$20<>\"\",ROW(F$1:F$20)-ROW(F$1)+1),ROWS(F$1:F7))),\"\")","v":""}]
[{"$f":"'Internal Calc '!C18","v":""},{"$f":"'Internal Calc '!E18","v":0},{"$f":"'Deal Builder'!L27","v":0},0,{"$f":"'Deal Builder'!N27","v":0},0,null,null,{"$f":"IFERROR(INDEX(A$1:A$20,SMALL(IF($A$1:$A$20<>\"\",ROW(A$1:A$20)-ROW(A$1)+1),ROWS(A$1:A8))),\"\")","v":""},{"$f":"IFERROR(INDEX(B$1:B$20,SMALL(IF($A$1:$A$20<>\"\",ROW(B$1:B$20)-ROW(B$1)+1),ROWS(B$1:B8))),\"\")","v":""},{"$f":"IFERROR(INDEX(C$1:C$20,SMALL(IF($A$1:$A$20<>\"\",ROW(C$1:C$20)-ROW(C$1)+1),ROWS(C$1:C8))),\"\")","v":""},{"$f":"IFERROR(INDEX(E$1:E$20,SMALL(IF($A$1:$A$20<>\"\",ROW(E$1:E$20)-ROW(E$1)+1),ROWS(E$1:E8))),\"\")","v":""},{"$f":"IFERROR(INDEX(F$1:F$20,SMALL(IF($A$1:$A$20<>\"\",ROW(F$1:F$20)-ROW(F$1)+1),ROWS(F$1:F8))),\"\")","v":""}]
[{"$f":"'Internal Calc '!C19","v":""},{"$f":"'Internal Calc '!E19","v":0},{"$f":"'Deal Builder'!L28","v":0},0,{"$f":"'Deal Builder'!N28","v":0},0,null,null,{"$f":"IFERROR(INDEX(A$1:A$20,SMALL(IF($A$1:$A$20<>\"\",ROW(A$1:A$20)-ROW(A$1)+1),ROWS(A$1:A9))),\"\")","v":""},{"$f":"IFERROR(INDEX(B$1:B$20,SMALL(IF($A$1:$A$20<>\"\",ROW(B$1:B$20)-ROW(B$1)+1),ROWS(B$1:B9))),\"\")","v":""},{"$f":"IFERROR(INDEX(C$1:C$20,SMALL(IF($A$1:$A$20<>\"\",ROW(C$1:C$20)-ROW(C$1)+1),ROWS(C$1:C9))),\"\")","v":""},{"$f":"IFERROR(INDEX(E$1:E$20,SMALL(IF($A$1:$A$20<>\"\",ROW(E$1:E$20)-ROW(E$1)+1),ROWS(E$1:E9))),\"\")","v":""},{"$f":"IFERROR(INDEX(F$1:F$20,SMALL(IF($A$1:$A$20<>\"\",ROW(F$1:F$20)-ROW(F$1)+1),ROWS(F$1:F9))),\"\")","v":""}]
[{"$f":"IF(B10=0,\"\",\"Total\")","v":""},{"$f":"SUM(B2:B9)","v":0},{"$f":"SUM(C2:C9)","v":0},{"$f":"SUM(D2:D9)","v":0},0,0,null,null,{"$f":"IFERROR(INDEX(A$1:A$20,SMALL(IF($A$1:$A$20<>\"\",ROW(A$1:A$20)-ROW(A$1)+1),ROWS(A$1:A10))),\"\")","v":""},{"$f":"IFERROR(INDEX(B$1:B$20,SMALL(IF($A$1:$A$20<>\"\",ROW(B$1:B$20)-ROW(B$1)+1),ROWS(B$1:B10))),\"\")","v":""},{"$f":"IFERROR(INDEX(C$1:C$20,SMALL(IF($A$1:$A$20<>\"\",ROW(C$1:C$20)-ROW(C$1)+1),ROWS(C$1:C10))),\"\")","v":""},{"$f":"IFERROR(INDEX(E$1:E$20,SMALL(IF($A$1:$A$20<>\"\",ROW(E$1:E$20)-ROW(E$1)+1),ROWS(E$1:E10))),\"\")","v":""},{"$f":"IFERROR(INDEX(F$1:F$20,SMALL(IF($A$1:$A$20<>\"\",ROW(F$1:F$20)-ROW(F$1)+1),ROWS(F$1:F10))),\"\")","v":""}]
{"$rows_left_out":11}
{"sheet":"Lookups","index":8,"n_rows":17,"n_cols":16,"rows_kept":17,"cut":false,"hidden":true,"merged":[]}
["Cell Reference"]
[]
[null,1,"onetariff",null,null,"1Sim Only Single User","tsosu",null,1,"One",null,"O2","otwo",null,"Small Biz Shared Data","sbsd"]
[null,12,"twelvetariff",null,null,"1Mobile Broadband","tmbb",null,12,"Twelve",null,"Vodafone","vodafone",null,"Shared Minutes","sm"]
[null,24,"twentyfourtariff",null,null,"24Sim Only Single User","tfsosu",null,24,"Twenty",null,null,null,null,"Shared Texts","st"]
[null,null,null,null,null,"24Single User","tfsu",null,null,null,null,null,null,null,"Individual Data","id"]
[null,null,null,null,null,"24Business Single Shared Data","tfbssd",null,null,null,null,null,null,null,"Shared Data","sd"]
[null,null,null,null,null,"24Parent","tfp",null,null,null,null,null,null,null,"Individual Topup","it"]
[null,null,null,null,null,"24Child","tfc",null,null,null,null,null,null,null,"UK Data Bolt On","ukdbo"]
[null,null,null,null,null,"24Mobile Broadband","tfmbb",null,null,null,null,null,null,null,"Roaming Data Bolt-ons","rdbo"]
{"$rows_left_out":8}
{"sheet":"Drop Downs","index":9,"n_rows":15,"n_cols":31,"rows_kept":15,"cut":false,"hidden":true,"merged":[]}
["Cell Reference"]
["Name Ref","TermLength","onetariffNetwork","twelvetariffNetwork","twentyfourtariffNetwork","Vodafoneonetariff","oflex","tflex","O2onetariff","O2twentyfourtariff","tsosu","tmbb","tfsosu","tfmbb","tfmbbag","os","osmbb","Twentyotwobo","Twelveotwobo/Oneotwobo","Onevodafonebo/Twelvevodfonebo/Twentyvodafonebo","sbsd","id","it","rdbo","rimbo","uatbo","nmbo","rd","rowm","ic","CBMName"]
[]
[null,"Choose..","Choose..","Choose..","Choose..","Choose..","Choose..","Choose..","Choose..","Choose..","Choose..","Choose..","Choose..","Choose..","Choose..","Choose..","Choose..","Choose..","Choose..","Choose..","Choose..","Choose..","Choose..","Choose..","Choose..","Choose..","Choose..","Choose..","Choose..","Choose..","Choose.."]
[null,1,"O2","O2","O2","Single","Flex 30D WS","Flex 24M WS","Sim Only Single User","Sim Only Single User","Small Biz 300MB 30D WS","Mobile Broadband 1GB 30D","Small Biz 300MB 24M WS","Mobile Broadband 1GB 24M","Mobile Broadband 2GB Agg 24M","Forever Connected 500","2GB","Roaming Data","Roaming Data","UK Data Bolt On","Shared Data 5GB Wholesale 24M","Individual 500MB Wholesale Data Bolt on 24M","Individual 500MB Wholesale Data Top Up","250MB World Data","International Caller**","100 International SMS","100 Non Geo Mins","ROW Data 500MB (WS)","ROW 250 mins","Int. Caller 120 Mins","Ian Davis "]
[null,24,null,null,null,"MBB",null,null,"Flex","Flex","Small Biz 500MB 30D WS","Mobile Broadband 2GB 30D","Small Biz 500MB 24M WS","Mobile Broadband 2GB 24M","Mobile Broadband 4GB Agg 24M","Forever Connected","5GB","ROW Minutes","ROW Minutes","Roaming Data Bolt-ons","Shared Data 10GB Wholesale 24M","Individual 1GB Wholesale Data Bolt on 24M","Individual 1GB Wholesale Data Top Up","500MB World Data","100 mins UK - EU","250 International SMS","300 Non Geo Mins","ROW Data 1GB (WS)","ROW 500 mins","Int. Caller 500 Mins","Rob Foster"]
[null,null,null,null,null,null,null,null,"Mobile Broadband","Mobile Broadband","Small Biz 2GB 30D WS","Mobile Broadband 4GB 30D","Small Biz 2GB 24M WS","Mobile Broadband 4GB 24M","Mobile Broadband 8GB Agg 24M","Forever Connected 3GB","10GB","International Caller","International Caller","Roam & International Min Bolt ons","Shared Data 20GB Wholesale 24M","Individual 2GB Wholesale Data Bolt on 24M","Individual 2GB Wholesale Data Top Up","1GB World Data","500 mins UK - EU","500 International SMS",null,null,null,null,"Anton Le Saux"]
[null,null,null,null,null,null,null,null,null,null,"Small Biz 3GB 30D WS","Mobile Broadband 8GB 30D","Small Biz 3GB 24M WS","Mobile Broadband 8GB 24M","Mobile Broadband 20GB Agg 24M","Forever Connected 5GB","20GB",null,null,"UK to Abroad Text Bolt-ons","Shared Data 30GB Wholesale 24M","Individual 5GB Wholesale Data Bolt on 24M","Individual 5GB Wholesale Data Top Up",null,"1000 mins UK - EU","1000 International SMS",null,null,null,null,"Ben Ofosu"]
[null,null,null,null,null,null,null,null,null,null,"Small Biz 5GB 30D WS","Mobile Broadband 20GB 30D","Small Biz 5GB 24M WS","Mobile Broadband 20GB 24M","Mobile Broadband 30GB Agg 24M","Forever Connected 10GB","40GB",null,null,"NGN Min Bolt ons","Shared Data 40GB Wholesale 24M","Individual 8GB Wholesale Data Bolt on 24M","Individual 8GB Wholesale Data Top Up",null,"100 mins UK - World",null,null,null,null,null,"Jon Reynolds"]
[null,null,null,null,null,null,null,null,null,null,"Small Biz 8GB 30D WS","Mobile Broadband 30GB 30D","Small Biz 8GB 24M WS","Mobile Broadband 30GB 24M",null,"Forever Connected 20GB","50GB",null,null,null,"Shared Data 50GB Wholesale 24M",null,null,null,"500 mins UK - World",null,null,null,null,null,"Gemma Stopford"]
{"$rows_left_out":6}
{"sheet":"Pricing","index":10,"n_rows":111,"n_cols":7,"rows_kept":111,"cut":false,"hidden":true,"merged":[]}
["Tariff","Data","Term",null,"Standard Sell",null,"Overage Revenue"]
["Small Biz 300MB 30D WS","300MB","30D",null,5.7,null,3.25]
["Small Biz 500MB 30D WS","500MB","30D",null,6.9,null,3.25]
["Small Biz 2GB 30D WS","2GB","30D",null,8.5,null,3.25]
["Small Biz 3GB 30D WS","3GB","30D",null,8.5,null,3.25]
["Small Biz 5GB 30D WS","5GB","30D",null,9.5,null,3.25]
["Small Biz 8GB 30D WS","8GB","30D",null,10.5,null,3.25]
["Small Biz 16GB 30D WS","16GB","30D",null,11.25,null,3.25]
["Small Biz 24GB 30D WS","24GB","30D",null,12,null,3.25]
["Small Biz 32GB 30D WS","32GB","30D",null,12.5,null,3.25]
{"$rows_left_out":101}